{"text_format":"1","workbook":"xlsx","n_sheets":10,"sheets":["Help","Projects","DROPDOWNS","Unit Costs","Assumptions","Cross-Sections","Cross-Section Comparison","Template","1","2"],"not_rendered":{"charts":0,"images":4,"macros":1,"external_links":2,"defined_names":51,"comments":0,"pivot_tables":0},"unopened":[],"bounds":{"document_bytes":16777216,"sheet_cells":100000,"rows_first":2000,"rows_last":500,"rows_between":2000,"halvings":0,"cell_chars":16384,"cell_head_chars":4096},"cells_cut":0,"cells_raw":0,"read":"whole","date_system":"1900"}

{"sheet":"Help","index":0,"n_rows":17,"n_cols":4,"rows_kept":17,"cut":false,"hidden":false,"merged":[]}
["Help",null,null,"Back to Projects Tab"]
[]
["Purpose of this Spreadsheet"]
["· Most cities have a different amount of transportation projects"]
["· This is designed to organize projects in an easy to read manner"]
["· It is designed to easily input projects and update the fields"]
[]
["How to use this Spreadsheet"]
["1) Go to the Unit Costs Tab","1)"]
["2) Check the tables and make sure all the pricing and the percentages are correct."]
{"$rows_left_out":8}
{"sheet":"Projects","index":1,"n_rows":5,"n_cols":13,"rows_kept":5,"cut":false,"hidden":false,"merged":[[1,1,1,8]]}
[null,null,null,null,null,null,null,null,null,null,null,null,"Help"]
[null,"Project Summary (All Projects)"]
[null,"Project","Location","Project Type","Total Price","Funding Source","Range (Yr)",{"$f":"'Unit Costs'!B1 & \" %\"","v":"Provo %"},{"$f":"'Unit Costs'!B1&\" Total\"","v":"Provo Total"}]
[null,1,"asdfafs","New",null,"City",10,{"$f":"'1'!$E$34","v":0.26638615391484843},{"$f":"'1'!$E$35","v":50000}]
[null,2,"new streets","New",null,"City",10,{"$f":"'2'!$E$34","v":0.26638615391484843},{"$f":"'2'!$E$35","v":90000}]

{"sheet":"DROPDOWNS","index":2,"n_rows":22,"n_cols":8,"rows_kept":22,"cut":false,"hidden":false,"merged":[]}
[]
[null,"Project Type","City %","Funding","Range (yr)","Cross-Sections",null,"Back to Projects Tab"]
[null,"New",null,"City",10,"Arterial"]
[null,"Capacity Improvement",1,"City/MAG",25,"5 ln Commercial Collector"]
[null,"Traffic Signal",1,"UDOT",null,"3 ln Commercial Collector"]
[null,"Roundabout",1,null,null,"Major Collector"]
[null,"Intersection Improvement",1,null,null,"Major Collector (No Bike)"]
[null,null,null,null,null,"Minor Collector (Add. ROW)"]
[null,null,null,null,null,"Minor Collector"]
[null,null,null,null,null,"Rural Street"]
{"$rows_left_out":13}
{"sheet":"Unit Costs","index":3,"n_rows":25,"n_cols":7,"rows_kept":25,"cut":false,"hidden":false,"merged":[[24,2,24,3],[0,1,0,3],[1,1,1,3],[2,1,2,3],[19,2,19,3],[21,2,21,3],[23,2,23,3]]}
[null,"Provo",null,null,null,1]
[null,"Transportation Improvement Program (TIP)"]
[null,"Unit Costs",null,null,null,null,"Back to Projects Tab"]
[null,"Item","Unit","Unit Cost"]
[null,"Parkstrip","S.F.",10]
[null,"Removal of Existing Asphalt","S.Y.",4]
[null,"Clearing and Grubbing","Acre",2000]
[null,"Roadway Excavation","C.Y.",10.5]
[null,"HMA Concrete","Ton",85]
[null,"Untreated Base Course","C.Y.",15]
{"$rows_left_out":16}
{"sheet":"Assumptions","index":4,"n_rows":12,"n_cols":17,"rows_kept":12,"cut":false,"hidden":false,"merged":[]}
[]
[null,null,null,"HMA Pavement Density (pcf)","HMA Thickness (in)","Untreated Base Course Thickness (in)","Granual Borrow Thickness (in)","Roadway Excavation Depth (ft)","No. Sidewalks (No.)","Parkstrip","Roadway Width","Curb & Gutter","Sidewalk Width","X-Section Width","Impact Fee %",null,"Back to Projects Tab"]
[null,null,{"$f":"DROPDOWNS!F3","v":"Arterial"},155,4,8,14,2.5,2,{"$f":"'Cross-Sections'!D3","v":5},{"$f":"'Cross-Sections'!F3","v":81},{"$f":"'Cross-Sections'!E3","v":2.5},{"$f":"'Cross-Sections'!C3","v":5},{"$f":"'Cross-Sections'!K3","v":106},{"$f":"'Cross-Section Comparison'!AC32","v":0.26638615391484843}]
[null,null,{"$f":"DROPDOWNS!F4","v":"5 ln Commercial Collector"},155,4,8,14,2.5,2,{"$f":"'Cross-Sections'!D6","v":0},{"$f":"'Cross-Sections'!F6","v":78},{"$f":"'Cross-Sections'!E6","v":2},{"$f":"'Cross-Sections'!C6","v":6},{"$f":"'Cross-Sections'!K6","v":94},{"$f":"'Cross-Section Comparison'!Z32","v":0.17212639115919304}]
[null,null,{"$f":"DROPDOWNS!F5","v":"3 ln Commercial Collector"},155,4,8,14,2.5,2,{"$f":"'Cross-Sections'!D9","v":0},{"$f":"'Cross-Sections'!F9","v":54},{"$f":"'Cross-Sections'!E9","v":2},{"$f":"'Cross-Sections'!C9","v":6},{"$f":"'Cross-Sections'!K9","v":70},{"$f":"'Cross-Section Comparison'!X32","v":0}]
[null,null,{"$f":"DROPDOWNS!F6","v":"Major Collector"},155,4,8,14,2.5,2,{"$f":"'Cross-Sections'!D12","v":10},{"$f":"'Cross-Sections'!F12","v":58},{"$f":"'Cross-Sections'!E12","v":2},{"$f":"'Cross-Sections'!C12","v":5},{"$f":"'Cross-Sections'!K12","v":92},{"$f":"'Cross-Section Comparison'!T32","v":0.22343452735164604}]
[null,null,{"$f":"DROPDOWNS!F7","v":"Major Collector (No Bike)"},155,4,8,14,2.5,2,{"$f":"'Cross-Sections'!D15","v":10},{"$f":"'Cross-Sections'!F15","v":50},{"$f":"'Cross-Sections'!E15","v":2},{"$f":"'Cross-Sections'!C15","v":5},{"$f":"'Cross-Sections'!K15","v":84},{"$f":"'Cross-Section Comparison'!Q32","v":0.17191689530855014}]
[null,null,{"$f":"DROPDOWNS!F8","v":"Minor Collector (Add. ROW)"},155,4,8,14,2.5,2,{"$f":"'Cross-Sections'!D18","v":8},{"$f":"'Cross-Sections'!F18","v":38},{"$f":"'Cross-Sections'!E18","v":2},{"$f":"'Cross-Sections'!C18","v":5},{"$f":"'Cross-Sections'!K18","v":96},{"$f":"'Cross-Section Comparison'!N32","v":0.23145212303583063}]
[null,null,{"$f":"DROPDOWNS!F9","v":"Minor Collector"},155,4,8,14,2.5,2,{"$f":"'Cross-Sections'!D21","v":8},{"$f":"'Cross-Sections'!F21","v":38},{"$f":"'Cross-Sections'!E21","v":2},{"$f":"'Cross-Sections'!C21","v":5},{"$f":"'Cross-Sections'!K21","v":68},{"$f":"'Cross-Section Comparison'!K32","v":2.0336860847867899E-2}]
[null,null,{"$f":"DROPDOWNS!F10","v":"Rural Street"},155,3,8,14,2.5,2,{"$f":"'Cross-Sections'!D24","v":10},{"$f":"'Cross-Sections'!F24","v":40},{"$f":"'Cross-Sections'!E24","v":0},{"$f":"'Cross-Sections'!C24","v":5},{"$f":"'Cross-Sections'!K24","v":70},{"$f":"'Cross-Section Comparison'!H32","v":5.6959034898293903E-2}]
{"$rows_left_out":3}
{"sheet":"Cross-Sections","index":5,"n_rows":28,"n_cols":13,"rows_kept":28,"cut":false,"hidden":false,"merged":[[26,0,27,0],[26,10,27,10],[27,1,27,3],[27,4,27,6],[27,7,27,9],[20,0,21,0],[20,10,21,10],[21,1,21,3],[21,4,21,6],[21,7,21,9],[23,0,24,0],[23,10,24,10],[24,1,24,3],[24,4,24,6],[24,7,24,9],[14,0,15,0],[14,10,15,10],[15,1,15,3],[15,4,15,6],[15,7,15,9],[17,0,18,0],[17,10,18,10],[18,1,18,3],[18,4,18,6],[18,7,18,9],[8,0,9,0],[8,10,9,10],[9,1,9,3],[9,4,9,6],[9,7,9,9],[11,0,12,0],[11,10,12,10],[12,1,12,3],[12,4,12,6],[12,7,12,9],[2,0,3,0],[2,10,3,10],[3,1,3,3],[3,4,3,6],[3,7,3,9],[5,0,6,0],[5,10,6,10],[6,1,6,3],[6,4,6,6],[6,7,6,9]]}
[null,"P.U.E","Sidewalk","Parkstrip","Curb&Gut","Roadway","Curb&Gut","Parkstrip","Sidewalk","P.U.E","Total"]
[null,null,null,null,null,null,null,null,null,null,null,null,"Back to Projects Tab"]
[{"$f":"DROPDOWNS!F3","v":"Arterial"},0,5,5,2.5,81,2.5,5,5,0,{"$f":"SUM(B4:J4)","v":106}]
[null,{"$f":"SUM(B3:D3)","v":10},null,null,{"$f":"SUM(E3:G3)","v":86},null,null,{"$f":"SUM(H3:J3)","v":10}]
[]
[{"$f":"DROPDOWNS!F4","v":"5 ln Commercial Collector"},0,6,0,2,78,2,0,6,0,{"$f":"SUM(B7:J7)","v":94}]
[null,{"$f":"SUM(B6:D6)","v":6},null,null,{"$f":"SUM(E6:G6)","v":82},null,null,{"$f":"SUM(H6:J6)","v":6}]
[]
[{"$f":"DROPDOWNS!F5","v":"3 ln Commercial Collector"},0,6,0,2,54,2,0,6,0,{"$f":"SUM(B10:J10)","v":70}]
[null,{"$f":"SUM(B9:D9)","v":6},null,null,{"$f":"SUM(E9:G9)","v":58},null,null,{"$f":"SUM(H9:J9)","v":6}]
{"$rows_left_out":19}
{"sheet":"Cross-Section Comparison","index":6,"n_rows":50,"n_cols":32,"rows_kept":50,"cut":false,"hidden":false,"merged":[[36,0,36,2],[37,0,37,2],[38,0,38,2],[39,0,39,2],[28,0,28,2],[30,0,30,2],[31,0,31,2],[33,0,33,2],[34,0,34,2],[35,0,35,2],[26,0,26,2],[0,0,0,29],[1,0,1,29],[2,4,3,5],[2,7,3,8],[2,10,3,11],[2,13,3,14],[2,16,3,17],[2,19,3,20],[2,22,3,23],[2,25,3,26],[2,28,3,29],[19,0,19,2],[21,0,21,2],[23,0,23,2],[25,0,25,2]]}
[{"$f":"'Unit Costs'!B1&\" TMP\"","v":"Provo TMP"}]
["Developer's Responsibility vs. City's Responsibility",null,null,null,null,null,null,null,null,null,null,null,null,null,null,null,null,null,null,null,null,null,null,null,null,null,null,null,null,null,null,"Back to Projects Tab"]
[null,null,5,null,{"$f":"\"100' Length of \" & DROPDOWNS!F11","v":"100' Length of Local Street"},null,null,{"$f":"\"100' Length of \" & DROPDOWNS!F10","v":"100' Length of Rural Street"},null,null,{"$f":"\"100' Length of \" & DROPDOWNS!F9","v":"100' Length of Minor Collector"},null,null,{"$f":"\"100' Length of \" & DROPDOWNS!F8","v":"100' Length of Minor Collector (Add. ROW)"},null,null,{"$f":"\"100' Length of \" & DROPDOWNS!F7","v":"100' Length of Major Collector (No Bike)"},null,null,{"$f":"\"100' Length of \" & DROPDOWNS!F6","v":"100' Length of Major Collector"},null,null,{"$f":"\"100' Length of \" & DROPDOWNS!F5","v":"100' Length of 3 ln Commercial Collector"},null,null,{"$f":"\"100' Length of \" & DROPDOWNS!F4","v":"100' Length of 5 ln Commercial Collector"},null,null,{"$f":"\"100' Length of \" & DROPDOWNS!F3","v":"100' Length of Arterial"}]
[]
["Item","Unit","Unit Cost",null,"Quantity","Cost",null,"Quantity","Cost",null,"Quantity","Cost",null,"Quantity","Cost",null,"Quantity","Cost",null,"Quantity","Cost",null,"Quantity","Cost",null,"Quantity","Cost",null,"Quantity","Cost"]
[{"$f":"'Unit Costs'!B5","v":"Parkstrip"},{"$f":"'Unit Costs'!C5","v":"S.F."},{"$f":"'Unit Costs'!D5","v":10},null,{"$f":"'Cross-Sections'!$D$27*200","v":1600},{"$f":"E6*$C6","v":16000},null,{"$f":"'Cross-Sections'!$D$24*200","v":2000},{"$f":"H6*$C6","v":20000},null,{"$f":"'Cross-Sections'!$D$21*200","v":1600},{"$f":"K6*$C6","v":16000},null,{"$f":"'Cross-Sections'!$D$18*200","v":1600},{"$f":"N6*$C6","v":16000},null,{"$f":"'Cross-Sections'!$D$15*200","v":2000},{"$f":"Q6*$C6","v":20000},null,{"$f":"'Cross-Sections'!$D$12*200","v":2000},{"$f":"T6*$C6","v":20000},null,{"$f":"'Cross-Sections'!$D$9*200","v":0},{"$f":"W6*$C6","v":0},null,{"$f":"'Cross-Sections'!$D$6*200","v":0},{"$f":"Z6*$C6","v":0},null,{"$f":"'Cross-Sections'!$D$3*200","v":1000},{"$f":"AC6*$C6","v":10000}]
[{"$f":"'Unit Costs'!B6","v":"Removal of Existing Asphalt"},{"$f":"'Unit Costs'!C6","v":"S.Y."},{"$f":"'Unit Costs'!D6","v":4},null,0,{"$f":"E7*$C7","v":0},null,0,{"$f":"H7*$C7","v":0},null,0,{"$f":"K7*$C7","v":0},null,0,{"$f":"N7*$C7","v":0},null,0,{"$f":"Q7*$C7","v":0},null,0,{"$f":"T7*$C7","v":0},null,0,{"$f":"W7*$C7","v":0},null,0,{"$f":"Z7*$C7","v":0},null,0,{"$f":"AC7*$C7","v":0}]
[{"$f":"'Unit Costs'!B7","v":"Clearing and Grubbing"},{"$f":"'Unit Costs'!C7","v":"Acre"},{"$f":"'Unit Costs'!D7","v":2000},null,{"$f":"'Cross-Sections'!$K$27*100/43560","v":0.15151515151515152},{"$f":"E8*$C8","v":303.03030303030306},null,{"$f":"'Cross-Sections'!$K$24*100/43560","v":0.16069788797061524},321.39577594123045,null,{"$f":"'Cross-Sections'!$K$21*100/43560","v":0.15610651974288339},312.21303948576679,null,{"$f":"'Cross-Sections'!$K$18*100/43560","v":0.22038567493112948},440.77134986225894,null,{"$f":"'Cross-Sections'!$K$15*100/43560","v":0.1928374655647383},385.67493112947659,null,{"$f":"'Cross-Sections'!$K$12*100/43560","v":0.21120293847566574},422.40587695133149,null,{"$f":"'Cross-Sections'!$K$9*100/43560","v":0.16069788797061524},321.39577594123045,null,{"$f":"'Cross-Sections'!$K$6*100/43560","v":0.21579430670339761},431.58861340679522,null,{"$f":"'Cross-Sections'!$K$3*100/43560","v":0.24334251606978879},486.68503213957757]
[{"$f":"'Unit Costs'!B8","v":"Roadway Excavation"},{"$f":"'Unit Costs'!C8","v":"C.Y."},{"$f":"'Unit Costs'!D8","v":10.5},null,{"$f":"'Cross-Sections'!$E$27*100*F39/27","v":18.518518518518519},{"$f":"E9*$C9","v":194.44444444444446},null,{"$f":"'Cross-Sections'!$E$24*100*I39/27","v":0},0,null,{"$f":"'Cross-Sections'!$E$21*100*L39/27","v":18.518518518518519},194.44444444444446,null,{"$f":"'Cross-Sections'!$E$18*100*O39/27","v":18.518518518518519},194.44444444444446,null,{"$f":"'Cross-Sections'!$E$15*100*R39/27","v":18.518518518518519},194.44444444444446,null,{"$f":"'Cross-Sections'!$E$12*100*U39/27","v":18.518518518518519},194.44444444444446,null,{"$f":"'Cross-Sections'!$E$9*100*X39/27","v":18.518518518518519},194.44444444444446,null,{"$f":"'Cross-Sections'!$E$6*100*AA39/27","v":18.518518518518519},194.44444444444446,null,{"$f":"'Cross-Sections'!$E$3*100*AD39/27","v":23.148148148148149},243.05555555555557]
[{"$f":"'Unit Costs'!B9","v":"HMA Concrete"},{"$f":"'Unit Costs'!C9","v":"Ton"},{"$f":"'Unit Costs'!D9","v":85},null,{"$f":"'Cross-Sections'!$E$27*100*(F36/12)*F35/2000","v":3.875},{"$f":"E10*$C10","v":329.375},null,{"$f":"'Cross-Sections'!$E$24*100*(I36/12)*I35/2000","v":0},0,null,{"$f":"'Cross-Sections'!$E$21*100*(L36/12)*L35/2000","v":5.1666666666666661},439.16666666666663,null,{"$f":"'Cross-Sections'!$E$18*100*(O36/12)*O35/2000","v":5.1666666666666661},439.16666666666663,null,{"$f":"'Cross-Sections'!$E$15*100*(R36/12)*R35/2000","v":5.1666666666666661},439.16666666666663,null,{"$f":"'Cross-Sections'!$E$12*100*(U36/12)*U35/2000","v":5.1666666666666661},439.16666666666663,null,{"$f":"'Cross-Sections'!$E$9*100*(X36/12)*X35/2000","v":5.1666666666666661},439.16666666666663,null,{"$f":"'Cross-Sections'!$E$6*100*(AA36/12)*AA35/2000","v":5.1666666666666661},439.16666666666663,null,{"$f":"'Cross-Sections'!$E$3*100*(AD36/12)*AD35/2000","v":6.458333333333333},548.95833333333326]
{"$rows_left_out":41}
{"sheet":"Template","index":7,"n_rows":53,"n_cols":10,"rows_kept":53,"cut":false,"hidden":false,"merged":[[63,0,63,2],[29,0,29,2],[31,0,31,3],[33,0,34,3],[55,0,55,2],[57,0,57,2],[58,0,58,2],[4,0,4,4],[5,0,5,4],[59,0,59,2],[61,0,61,2],[62,0,62,2],[28,0,28,2],[6,0,6,4],[7,6,7,8],[9,6,9,8],[10,6,10,8],[11,6,11,8],[13,6,13,8],[14,6,14,8],[15,6,15,8],[22,0,22,3],[24,0,24,2],[26,0,26,2],[0,0,0,4],[1,0,1,4],[2,0,2,1],[3,0,3,1],[2,6,3,7]]}
[{"$f":"'Unit Costs'!B1","v":"Provo"}]
["Transportation Master Plan "]
["Project No.",null,{"$f":"'Unit Costs'!F1","v":1},null,null,null,"Back to Projects Tab"]
["Improvement Type:",null,{"$f":"VLOOKUP(A5,Projects!$C$3:$D$103,2,FALSE)","v":"New"}]
[{"$f":"VLOOKUP(C3,Projects!$B$3:$C$102,2,FALSE)","v":"asdfafs"}]
["Arterial"]
["Costs"]
["Item","Unit","Unit Cost","Quantity","Cost",null,"Length of Segment",null,null,100]
[{"$f":"IF('Unit Costs'!B5=\"\",\"\",'Unit Costs'!B5)","v":"Parkstrip"},{"$f":"IF('Unit Costs'!C5=\"\",\"\",'Unit Costs'!C5)","v":"S.F."},{"$f":"IF('Unit Costs'!D5=\"\",\"\",'Unit Costs'!D5)","v":10},{"$f":"IF(J12=0,\"\",IF(C9=\"\",\"\",VLOOKUP($A$6,Assumptions!C3:N11,8,FALSE)*2*J8))","v":1000},{"$f":"IF(C9=\"\",\"\",D9*C9)","v":10000}]
[{"$f":"IF('Unit Costs'!B6=\"\",\"\",'Unit Costs'!B6)","v":"Removal of Existing Asphalt"},{"$f":"IF('Unit Costs'!C6=\"\",\"\",'Unit Costs'!C6)","v":"S.Y."},{"$f":"IF('Unit Costs'!D6=\"\",\"\",'Unit Costs'!D6)","v":4},{"$f":"IF(J15=0,0,IF(C10=\"\",\"\",IF(C10>0,((J15*J8)/9),\"\")))","v":0},{"$f":"IF(C10=\"\",\"\",D10*C10)","v":0},null,"Total ROW Needed",null,null,{"$f":"VLOOKUP($A$6,Assumptions!$C$3:$N$11,12,FALSE)","v":106}]
{"$rows_left_out":44}
{"sheet":"1","index":8,"n_rows":53,"n_cols":10,"rows_kept":53,"cut":false,"hidden":false,"merged":[[11,6,11,8],[0,0,0,4],[1,0,1,4],[2,0,2,1],[2,6,3,7],[3,0,3,1],[4,0,4,4],[5,0,5,4],[6,0,6,4],[7,6,7,8],[9,6,9,8],[10,6,10,8],[57,0,57,2],[13,6,13,8],[14,6,14,8],[15,6,15,8],[22,0,22,3],[24,0,24,2],[26,0,26,2],[28,0,28,2],[29,0,29,2],[31,0,31,3],[33,0,34,3],[55,0,55,2],[58,0,58,2],[59,0,59,2],[61,0,61,2],[62,0,62,2],[63,0,63,2]]}
[{"$f":"'Unit Costs'!B1","v":"Provo"}]
["Transportation Master Plan "]
["Project No.",null,1,null,null,null,"Back to Projects Tab"]
["Improvement Type:",null,{"$f":"VLOOKUP(A5,Projects!$C$3:$D$103,2,FALSE)","v":"New"}]
[{"$f":"VLOOKUP(C3,Projects!$B$3:$C$102,2,FALSE)","v":"asdfafs"}]
["Arterial"]
["Costs"]
["Item","Unit","Unit Cost","Quantity","Cost",null,"Length of Segment",null,null,50]
[{"$f":"IF('Unit Costs'!B5=\"\",\"\",'Unit Costs'!B5)","v":"Parkstrip"},{"$f":"IF('Unit Costs'!C5=\"\",\"\",'Unit Costs'!C5)","v":"S.F."},{"$f":"IF('Unit Costs'!D5=\"\",\"\",'Unit Costs'!D5)","v":10},{"$f":"IF(J12=0,\"\",IF(C9=\"\",\"\",VLOOKUP($A$6,Assumptions!C3:N11,8,FALSE)*2*J8))","v":500},{"$f":"IF(C9=\"\",\"\",D9*C9)","v":5000}]
[{"$f":"IF('Unit Costs'!B6=\"\",\"\",'Unit Costs'!B6)","v":"Removal of Existing Asphalt"},{"$f":"IF('Unit Costs'!C6=\"\",\"\",'Unit Costs'!C6)","v":"S.Y."},{"$f":"IF('Unit Costs'!D6=\"\",\"\",'Unit Costs'!D6)","v":4},{"$f":"IF(J15=0,0,IF(C10=\"\",\"\",IF(C10>0,((J15*J8)/9),\"\")))","v":0},{"$f":"IF(C10=\"\",\"\",D10*C10)","v":0},null,"Total ROW Needed",null,null,{"$f":"VLOOKUP($A$6,Assumptions!$C$3:$N$11,12,FALSE)","v":106}]
{"$rows_left_out":44}
{"sheet":"2","index":9,"n_rows":53,"n_cols":10,"rows_kept":53,"cut":false,"hidden":false,"merged":[[58,0,58,2],[59,0,59,2],[61,0,61,2],[62,0,62,2],[63,0,63,2],[28,0,28,2],[29,0,29,2],[31,0,31,3],[33,0,34,3],[55,0,55,2],[57,0,57,2],[13,6,13,8],[14,6,14,8],[15,6,15,8],[22,0,22,3],[24,0,24,2],[26,0,26,2],[5,0,5,4],[6,0,6,4],[7,6,7,8],[9,6,9,8],[10,6,10,8],[11,6,11,8],[0,0,0,4],[1,0,1,4],[2,0,2,1],[2,6,3,7],[3,0,3,1],[4,0,4,4]]}
[{"$f":"'Unit Costs'!B1","v":"Provo"}]
["Transportation Master Plan "]
["Project No.",null,2,null,null,null,"Back to Projects Tab"]
["Improvement Type:",null,{"$f":"VLOOKUP(A5,Projects!$C$3:$D$103,2,FALSE)","v":"New"}]
[{"$f":"VLOOKUP(C3,Projects!$B$3:$C$102,2,FALSE)","v":"new streets"}]
["Arterial"]
["Costs"]
["Item","Unit","Unit Cost","Quantity","Cost",null,"Length of Segment",null,null,100]
[{"$f":"IF('Unit Costs'!B5=\"\",\"\",'Unit Costs'!B5)","v":"Parkstrip"},{"$f":"IF('Unit Costs'!C5=\"\",\"\",'Unit Costs'!C5)","v":"S.F."},{"$f":"IF('Unit Costs'!D5=\"\",\"\",'Unit Costs'!D5)","v":10},{"$f":"IF(J12=0,\"\",IF(C9=\"\",\"\",VLOOKUP($A$6,Assumptions!C3:N11,8,FALSE)*2*J8))","v":1000},{"$f":"IF(C9=\"\",\"\",D9*C9)","v":10000}]
[{"$f":"IF('Unit Costs'!B6=\"\",\"\",'Unit Costs'!B6)","v":"Removal of Existing Asphalt"},{"$f":"IF('Unit Costs'!C6=\"\",\"\",'Unit Costs'!C6)","v":"S.Y."},{"$f":"IF('Unit Costs'!D6=\"\",\"\",'Unit Costs'!D6)","v":4},{"$f":"IF(J15=0,0,IF(C10=\"\",\"\",IF(C10>0,((J15*J8)/9),\"\")))","v":0},{"$f":"IF(C10=\"\",\"\",D10*C10)","v":0},null,"Total ROW Needed",null,null,{"$f":"VLOOKUP($A$6,Assumptions!$C$3:$N$11,12,FALSE)","v":106}]
{"$rows_left_out":43}